Jenkins CI

Jenkins monitors executions of repeated jobs, such as building a software project or jobs run by cron.
1234 ... 8971
Topics (313955)
Replies Last Post Views Sub Forum
[JIRA] (JENKINS-61267) Build issues 'due to bug in the code' https://sdt-idp-canary.vci.att.com:20725/jenkins/ by JIRA noreply@jenkins...
0
by JIRA noreply@jenkins...
Jenkins issues
[JIRA] (JENKINS-61266) Cannot pass a value to a job with Extensible Choice paramater? by JIRA noreply@jenkins...
0
by JIRA noreply@jenkins...
Jenkins issues
[JIRA] (JENKINS-61265) Job with Extensible Groovy script does NOT get latest value when triggered by another job by JIRA noreply@jenkins...
0
by JIRA noreply@jenkins...
Jenkins issues
[JIRA] (JENKINS-61265) Job with Extensible Groovy script does NOT get latest value when triggered by another job by JIRA noreply@jenkins...
0
by JIRA noreply@jenkins...
Jenkins issues
[JIRA] (JENKINS-61265) Job with Extensible Groovy script does NOT get latest value when triggered by another job by JIRA noreply@jenkins...
0
by JIRA noreply@jenkins...
Jenkins issues
[JIRA] (JENKINS-61265) Job with Extensible Groovy script does NOT get latest value when triggered by another job by JIRA noreply@jenkins...
0
by JIRA noreply@jenkins...
Jenkins issues
[JIRA] (JENKINS-61265) Job with Extensible Groovy script does NOT get latest value when triggered by another job by JIRA noreply@jenkins...
0
by JIRA noreply@jenkins...
Jenkins issues
[JIRA] (JENKINS-61265) Job with Extensible Groovy script does NOT get latest value when triggered by another job by JIRA noreply@jenkins...
0
by JIRA noreply@jenkins...
Jenkins issues
[JIRA] (JENKINS-61266) Cannot pass a value to a job with Extensible Choice paramater? by JIRA noreply@jenkins...
0
by JIRA noreply@jenkins...
Jenkins issues
[JIRA] (JENKINS-61266) How to pass a value to a job with Extensible Choice paramater? by JIRA noreply@jenkins...
0
by JIRA noreply@jenkins...
Jenkins issues
[JIRA] (JENKINS-61265) Job with Extensible Groovy script does NOT get latest value when triggered by another job by JIRA noreply@jenkins...
0
by JIRA noreply@jenkins...
Jenkins issues
[JIRA] (JENKINS-61265) Job with Extensible Groovy script does NOT get latest value when triggered by another job by JIRA noreply@jenkins...
0
by JIRA noreply@jenkins...
Jenkins issues
[JIRA] (JENKINS-61265) Job with Extensible Groovy script does NOT get latest value when triggered by another job by JIRA noreply@jenkins...
0
by JIRA noreply@jenkins...
Jenkins issues
[JIRA] (JENKINS-59705) hudson.remoting.ChannelClosedException: Channel "unknown": Remote call on JNLP4-connect connection from IP/IP:58344 failed. The channel is closing down or has closed dow by JIRA noreply@jenkins...
0
by JIRA noreply@jenkins...
Jenkins issues
[JIRA] (JENKINS-60917) Jenkins Pipeline requires at least one successfull build for the trigger to work by JIRA noreply@jenkins...
0
by JIRA noreply@jenkins...
Jenkins issues
[JIRA] (JENKINS-61264) Documentation for Configuration as Code AWS SSM Plugin by JIRA noreply@jenkins...
0
by JIRA noreply@jenkins...
Jenkins issues
[JIRA] (JENKINS-34044) EC2 Plugin: Windows: java.io.IOException: Pipe closed by JIRA noreply@jenkins...
0
by JIRA noreply@jenkins...
Jenkins issues
[JIRA] (JENKINS-34044) EC2 Plugin: Windows: java.io.IOException: Pipe closed by JIRA noreply@jenkins...
0
by JIRA noreply@jenkins...
Jenkins issues
[JIRA] (JENKINS-34044) EC2 Plugin: Windows: java.io.IOException: Pipe closed by JIRA noreply@jenkins...
0
by JIRA noreply@jenkins...
Jenkins issues
[JIRA] (JENKINS-61130) "ignoring quality gate result for one build" feature seems not to work by JIRA noreply@jenkins...
0
by JIRA noreply@jenkins...
Jenkins issues
[JIRA] (JENKINS-43389) switch statement default case not called if other match found in Pipeline DSL by JIRA noreply@jenkins...
0
by JIRA noreply@jenkins...
Jenkins issues
[JIRA] (JENKINS-61202) Read only view of job configuration page by JIRA noreply@jenkins...
0
by JIRA noreply@jenkins...
Jenkins issues
[JIRA] (JENKINS-60409) Form Submission Length Cap by JIRA noreply@jenkins...
0
by JIRA noreply@jenkins...
Jenkins issues
[JIRA] (JENKINS-60553) Remove teamconcert with security warning from wizard by JIRA noreply@jenkins...
0
by JIRA noreply@jenkins...
Jenkins issues
[JIRA] (JENKINS-60553) Remove teamconcert with security warning from wizard by JIRA noreply@jenkins...
0
by JIRA noreply@jenkins...
Jenkins issues
[JIRA] (JENKINS-61121) Too many open files when using Resource root URL by JIRA noreply@jenkins...
0
by JIRA noreply@jenkins...
Jenkins issues
[JIRA] (JENKINS-60907) Poor performance with jenkins.model.StandardArtifactManager.disableTrafficCompression=true by JIRA noreply@jenkins...
0
by JIRA noreply@jenkins...
Jenkins issues
[JIRA] (JENKINS-61071) Dynamic loading of @Initializer runs as anonymous user by JIRA noreply@jenkins...
0
by JIRA noreply@jenkins...
Jenkins issues
[JIRA] (JENKINS-60884) NPE in hudson.model.Run.getPreviousBuildsOverThreshold by JIRA noreply@jenkins...
0
by JIRA noreply@jenkins...
Jenkins issues
Backporting for LTS 2.222.1 started by Oliver Gondža-2
0
by Oliver Gondža-2
Jenkins dev
[JIRA] (JENKINS-61263) JUnit support flaky test - for multiple records of the same test in xml report by JIRA noreply@jenkins...
0
by JIRA noreply@jenkins...
Jenkins issues
[JIRA] (JENKINS-61262) Error on configure Jenkins save by JIRA noreply@jenkins...
0
by JIRA noreply@jenkins...
Jenkins issues
[JIRA] (JENKINS-61261) Ivy ClassNotFoundException when using Grab by JIRA noreply@jenkins...
0
by JIRA noreply@jenkins...
Jenkins issues
[JIRA] (JENKINS-61261) Ivy ClassNotFoundException when using Grab by JIRA noreply@jenkins...
0
by JIRA noreply@jenkins...
Jenkins issues
[JIRA] (JENKINS-61261) Ivy ClassNotFoundException when using Grab by JIRA noreply@jenkins...
0
by JIRA noreply@jenkins...
Jenkins issues
1234 ... 8971