Build failed in Hudson: Hudson » Hudson Build-Publisher plugin #182

Previous Topic Next Topic
 
classic Classic list List threaded Threaded
4 messages Options
Reply | Threaded
Open this post in threaded view
|

Build failed in Hudson: Hudson » Hudson Build-Publisher plugin #182

Erik Ramfelt
See http://hudson.ramfelt.se/job/Hudson/org.jvnet.hudson.plugins$build-publisher/182/changes

Changes:

[kohsuke] bumping up POM version

------------------------------------------
[INFO] ----------------------------------------------------------------------------
[INFO] Building Hudson Build-Publisher plugin
[INFO]    task-segment: [clean, install]
[INFO] ----------------------------------------------------------------------------
[INFO] [clean:clean]
[INFO] Deleting directory http://hudson.ramfelt.se/job/Hudson/org.jvnet.hudson.plugins$build-publisher/ws/target 
[INFO] Deleting directory http://hudson.ramfelt.se/job/Hudson/org.jvnet.hudson.plugins$build-publisher/ws/target/classes 
[INFO] Deleting directory http://hudson.ramfelt.se/job/Hudson/org.jvnet.hudson.plugins$build-publisher/ws/target/test-classes 
[INFO] Deleting directory http://hudson.ramfelt.se/job/Hudson/org.jvnet.hudson.plugins$build-publisher/ws/target/site 
[INFO] [enforcer:display-info {execution: default}]
[INFO] Maven Version: 2.0.6
[INFO] JDK Version: 1.6.0_02 normalized as: 1.6.0-2
[INFO] OS Info: Arch: i386 Family: unix Name: linux Version: 2.6.18-5-686
[INFO] [resources:resources]
[INFO] Using default encoding to copy filtered resources.
[INFO] [hpi:apt-compile]
[INFO] Compiling 11 source files to http://hudson.ramfelt.se/job/Hudson/org.jvnet.hudson.plugins$build-publisher/ws/target/classes 
Note: Generating hudson/plugins/build_publisher/BuildPublisher.stapler
http://hudson.ramfelt.se/job/Hudson/org.jvnet.hudson.plugins$build-publisher/ws/src/main/java/hudson/plugins/build_publisher/StatusAction.java :8: package javax.servlet does not exist
import javax.servlet.ServletException;
                    ^
http://hudson.ramfelt.se/job/Hudson/org.jvnet.hudson.plugins$build-publisher/ws/src/main/java/hudson/plugins/build_publisher/StatusAction.java :61: cannot find symbol
symbol  : class ServletException
location: class hudson.plugins.build_publisher.StatusAction
            throws ServletException, IOException {
                   ^
http://hudson.ramfelt.se/job/Hudson/org.jvnet.hudson.plugins$build-publisher/ws/src/main/java/hudson/plugins/build_publisher/StatusAction.java :71: cannot find symbol
symbol  : class ServletException
location: class hudson.plugins.build_publisher.StatusAction
            throws ServletException, IOException {
                   ^
http://hudson.ramfelt.se/job/Hudson/org.jvnet.hudson.plugins$build-publisher/ws/src/main/java/hudson/plugins/build_publisher/MavenBuildPublisher.java :83: cannot access javax.servlet.http.HttpServletRequest
class file for javax.servlet.http.HttpServletRequest not found
            req.bindParameters(mbp, "bp.");
               ^
http://hudson.ramfelt.se/job/Hudson/org.jvnet.hudson.plugins$build-publisher/ws/src/main/java/hudson/plugins/build_publisher/BuildPublisher.java :138: cannot find symbol
symbol  : method getParameterValues(java.lang.String)
location: interface org.kohsuke.stapler.StaplerRequest
            String[] names = req.getParameterValues("name");
                                ^
http://hudson.ramfelt.se/job/Hudson/org.jvnet.hudson.plugins$build-publisher/ws/src/main/java/hudson/plugins/build_publisher/BuildPublisher.java :139: cannot find symbol
symbol  : method getParameterValues(java.lang.String)
location: interface org.kohsuke.stapler.StaplerRequest
            String[] urls = req.getParameterValues("url");
                               ^
http://hudson.ramfelt.se/job/Hudson/org.jvnet.hudson.plugins$build-publisher/ws/src/main/java/hudson/plugins/build_publisher/BuildPublisher.java :140: cannot find symbol
symbol  : method getParameterValues(java.lang.String)
location: interface org.kohsuke.stapler.StaplerRequest
            String[] logins = req.getParameterValues("login");
                                 ^
http://hudson.ramfelt.se/job/Hudson/org.jvnet.hudson.plugins$build-publisher/ws/src/main/java/hudson/plugins/build_publisher/BuildPublisher.java :141: cannot find symbol
symbol  : method getParameterValues(java.lang.String)
location: interface org.kohsuke.stapler.StaplerRequest
            String[] passwords = req.getParameterValues("password");
                                    ^
http://hudson.ramfelt.se/job/Hudson/org.jvnet.hudson.plugins$build-publisher/ws/src/main/java/hudson/plugins/build_publisher/StatusAction.java :67: cannot access javax.servlet.http.HttpServletResponse
class file for javax.servlet.http.HttpServletResponse not found
        rsp.forwardToPreviousPage(req);
           ^
Note: Some input files use or override a deprecated API.
Note: Recompile with -Xlint:deprecation for details.
Note: Some input files use unchecked or unsafe operations.
Note: Recompile with -Xlint:unchecked for details.
9 errors
[HUDSON] Archiving http://hudson.ramfelt.se/job/Hudson/org.jvnet.hudson.plugins$build-publisher/ws/pom.xml 
[INFO] ------------------------------------------------------------------------
[ERROR] BUILD ERROR
[INFO] ------------------------------------------------------------------------
[INFO] Fatal error compiling

Embedded error: APT failed: 1
[INFO] ------------------------------------------------------------------------
[INFO] For more information, run Maven with the -e switch
[INFO] ------------------------------------------------------------------------
[INFO] Total time: 12 minutes 38 seconds
[INFO] Finished at: Sat Dec 01 00:15:50 CET 2007

---------------------------------------------------------------------
To unsubscribe, e-mail: [hidden email]
For additional commands, e-mail: [hidden email]

Reply | Threaded
Open this post in threaded view
|

Re: Build failed in Hudson: Hudson » Hudson Build-Publisher plugin #182

Kohsuke Kawaguchi
Administrator
Maven always find a way to bite me back. I committed a fix.

2007/11/30, [hidden email] <[hidden email]>:

> See http://hudson.ramfelt.se/job/Hudson/org.jvnet.hudson.plugins$build-publisher/182/changes
>
> Changes:
>
> [kohsuke] bumping up POM version
>
> ------------------------------------------
> [INFO] ----------------------------------------------------------------------------
> [INFO] Building Hudson Build-Publisher plugin
> [INFO]    task-segment: [clean, install]
> [INFO] ----------------------------------------------------------------------------
> [INFO] [clean:clean]
> [INFO] Deleting directory http://hudson.ramfelt.se/job/Hudson/org.jvnet.hudson.plugins$build-publisher/ws/target
> [INFO] Deleting directory http://hudson.ramfelt.se/job/Hudson/org.jvnet.hudson.plugins$build-publisher/ws/target/classes
> [INFO] Deleting directory http://hudson.ramfelt.se/job/Hudson/org.jvnet.hudson.plugins$build-publisher/ws/target/test-classes
> [INFO] Deleting directory http://hudson.ramfelt.se/job/Hudson/org.jvnet.hudson.plugins$build-publisher/ws/target/site
> [INFO] [enforcer:display-info {execution: default}]
> [INFO] Maven Version: 2.0.6
> [INFO] JDK Version: 1.6.0_02 normalized as: 1.6.0-2
> [INFO] OS Info: Arch: i386 Family: unix Name: linux Version: 2.6.18-5-686
> [INFO] [resources:resources]
> [INFO] Using default encoding to copy filtered resources.
> [INFO] [hpi:apt-compile]
> [INFO] Compiling 11 source files to http://hudson.ramfelt.se/job/Hudson/org.jvnet.hudson.plugins$build-publisher/ws/target/classes
> Note: Generating hudson/plugins/build_publisher/BuildPublisher.stapler
> http://hudson.ramfelt.se/job/Hudson/org.jvnet.hudson.plugins$build-publisher/ws/src/main/java/hudson/plugins/build_publisher/StatusAction.java :8: package javax.servlet does not exist
> import javax.servlet.ServletException;
>                     ^
> http://hudson.ramfelt.se/job/Hudson/org.jvnet.hudson.plugins$build-publisher/ws/src/main/java/hudson/plugins/build_publisher/StatusAction.java :61: cannot find symbol
> symbol  : class ServletException
> location: class hudson.plugins.build_publisher.StatusAction
>             throws ServletException, IOException {
>                    ^
> http://hudson.ramfelt.se/job/Hudson/org.jvnet.hudson.plugins$build-publisher/ws/src/main/java/hudson/plugins/build_publisher/StatusAction.java :71: cannot find symbol
> symbol  : class ServletException
> location: class hudson.plugins.build_publisher.StatusAction
>             throws ServletException, IOException {
>                    ^
> http://hudson.ramfelt.se/job/Hudson/org.jvnet.hudson.plugins$build-publisher/ws/src/main/java/hudson/plugins/build_publisher/MavenBuildPublisher.java :83: cannot access javax.servlet.http.HttpServletRequest
> class file for javax.servlet.http.HttpServletRequest not found
>             req.bindParameters(mbp, "bp.");
>                ^
> http://hudson.ramfelt.se/job/Hudson/org.jvnet.hudson.plugins$build-publisher/ws/src/main/java/hudson/plugins/build_publisher/BuildPublisher.java :138: cannot find symbol
> symbol  : method getParameterValues(java.lang.String)
> location: interface org.kohsuke.stapler.StaplerRequest
>             String[] names = req.getParameterValues("name");
>                                 ^
> http://hudson.ramfelt.se/job/Hudson/org.jvnet.hudson.plugins$build-publisher/ws/src/main/java/hudson/plugins/build_publisher/BuildPublisher.java :139: cannot find symbol
> symbol  : method getParameterValues(java.lang.String)
> location: interface org.kohsuke.stapler.StaplerRequest
>             String[] urls = req.getParameterValues("url");
>                                ^
> http://hudson.ramfelt.se/job/Hudson/org.jvnet.hudson.plugins$build-publisher/ws/src/main/java/hudson/plugins/build_publisher/BuildPublisher.java :140: cannot find symbol
> symbol  : method getParameterValues(java.lang.String)
> location: interface org.kohsuke.stapler.StaplerRequest
>             String[] logins = req.getParameterValues("login");
>                                  ^
> http://hudson.ramfelt.se/job/Hudson/org.jvnet.hudson.plugins$build-publisher/ws/src/main/java/hudson/plugins/build_publisher/BuildPublisher.java :141: cannot find symbol
> symbol  : method getParameterValues(java.lang.String)
> location: interface org.kohsuke.stapler.StaplerRequest
>             String[] passwords = req.getParameterValues("password");
>                                     ^
> http://hudson.ramfelt.se/job/Hudson/org.jvnet.hudson.plugins$build-publisher/ws/src/main/java/hudson/plugins/build_publisher/StatusAction.java :67: cannot access javax.servlet.http.HttpServletResponse
> class file for javax.servlet.http.HttpServletResponse not found
>         rsp.forwardToPreviousPage(req);
>            ^
> Note: Some input files use or override a deprecated API.
> Note: Recompile with -Xlint:deprecation for details.
> Note: Some input files use unchecked or unsafe operations.
> Note: Recompile with -Xlint:unchecked for details.
> 9 errors
> [HUDSON] Archiving http://hudson.ramfelt.se/job/Hudson/org.jvnet.hudson.plugins$build-publisher/ws/pom.xml
> [INFO] ------------------------------------------------------------------------
> [ERROR] BUILD ERROR
> [INFO] ------------------------------------------------------------------------
> [INFO] Fatal error compiling
>
> Embedded error: APT failed: 1
> [INFO] ------------------------------------------------------------------------
> [INFO] For more information, run Maven with the -e switch
> [INFO] ------------------------------------------------------------------------
> [INFO] Total time: 12 minutes 38 seconds
> [INFO] Finished at: Sat Dec 01 00:15:50 CET 2007
>
> ---------------------------------------------------------------------
> To unsubscribe, e-mail: [hidden email]
> For additional commands, e-mail: [hidden email]
>
>


--
Kohsuke Kawaguchi

---------------------------------------------------------------------
To unsubscribe, e-mail: [hidden email]
For additional commands, e-mail: [hidden email]

Reply | Threaded
Open this post in threaded view
|

Hudson build is back to normal: Hudson » Hudson Build-Publisher plugin #183

Erik Ramfelt
In reply to this post by Erik Ramfelt
See http://hudson.ramfelt.se/job/Hudson/org.jvnet.hudson.plugins$build-publisher/183/changes


---------------------------------------------------------------------
To unsubscribe, e-mail: [hidden email]
For additional commands, e-mail: [hidden email]

Reply | Threaded
Open this post in threaded view
|

RE: Re: Build failed in Hudson: Hudson > Hudson Build-Publisher plugin #182

tvworks
In reply to this post by Kohsuke Kawaguchi
LOL.  Maven does that to us all.

-----Original Message-----
From: [hidden email] [mailto:[hidden email]]
On Behalf Of Kohsuke Kawaguchi
Sent: Friday, November 30, 2007 11:30 PM
To: [hidden email]
Subject: Re: Build failed in Hudson: Hudson > Hudson Build-Publisher
plugin #182

Maven always find a way to bite me back. I committed a fix.

2007/11/30, [hidden email] <[hidden email]>:
> See
http://hudson.ramfelt.se/job/Hudson/org.jvnet.hudson.plugins$build-publi
sher/182/changes
>
> Changes:
>
> [kohsuke] bumping up POM version
>
> ------------------------------------------
> [INFO]
------------------------------------------------------------------------
----
> [INFO] Building Hudson Build-Publisher plugin
> [INFO]    task-segment: [clean, install]
> [INFO]
------------------------------------------------------------------------
----
> [INFO] [clean:clean]
> [INFO] Deleting directory
http://hudson.ramfelt.se/job/Hudson/org.jvnet.hudson.plugins$build-publi
sher/ws/target
> [INFO] Deleting directory
http://hudson.ramfelt.se/job/Hudson/org.jvnet.hudson.plugins$build-publi
sher/ws/target/classes
> [INFO] Deleting directory
http://hudson.ramfelt.se/job/Hudson/org.jvnet.hudson.plugins$build-publi
sher/ws/target/test-classes
> [INFO] Deleting directory
http://hudson.ramfelt.se/job/Hudson/org.jvnet.hudson.plugins$build-publi
sher/ws/target/site
> [INFO] [enforcer:display-info {execution: default}]
> [INFO] Maven Version: 2.0.6
> [INFO] JDK Version: 1.6.0_02 normalized as: 1.6.0-2
> [INFO] OS Info: Arch: i386 Family: unix Name: linux Version:
2.6.18-5-686
> [INFO] [resources:resources]
> [INFO] Using default encoding to copy filtered resources.
> [INFO] [hpi:apt-compile]
> [INFO] Compiling 11 source files to
http://hudson.ramfelt.se/job/Hudson/org.jvnet.hudson.plugins$build-publi
sher/ws/target/classes
> Note: Generating hudson/plugins/build_publisher/BuildPublisher.stapler
>
http://hudson.ramfelt.se/job/Hudson/org.jvnet.hudson.plugins$build-publi
sher/ws/src/main/java/hudson/plugins/build_publisher/StatusAction.java
:8: package javax.servlet does not exist
> import javax.servlet.ServletException;
>                     ^
>
http://hudson.ramfelt.se/job/Hudson/org.jvnet.hudson.plugins$build-publi
sher/ws/src/main/java/hudson/plugins/build_publisher/StatusAction.java
:61: cannot find symbol
> symbol  : class ServletException
> location: class hudson.plugins.build_publisher.StatusAction
>             throws ServletException, IOException {
>                    ^
>
http://hudson.ramfelt.se/job/Hudson/org.jvnet.hudson.plugins$build-publi
sher/ws/src/main/java/hudson/plugins/build_publisher/StatusAction.java
:71: cannot find symbol
> symbol  : class ServletException
> location: class hudson.plugins.build_publisher.StatusAction
>             throws ServletException, IOException {
>                    ^
>
http://hudson.ramfelt.se/job/Hudson/org.jvnet.hudson.plugins$build-publi
sher/ws/src/main/java/hudson/plugins/build_publisher/MavenBuildPublisher
.java :83: cannot access javax.servlet.http.HttpServletRequest
> class file for javax.servlet.http.HttpServletRequest not found
>             req.bindParameters(mbp, "bp.");
>                ^
>
http://hudson.ramfelt.se/job/Hudson/org.jvnet.hudson.plugins$build-publi
sher/ws/src/main/java/hudson/plugins/build_publisher/BuildPublisher.java
:138: cannot find symbol
> symbol  : method getParameterValues(java.lang.String)
> location: interface org.kohsuke.stapler.StaplerRequest
>             String[] names = req.getParameterValues("name");
>                                 ^
>
http://hudson.ramfelt.se/job/Hudson/org.jvnet.hudson.plugins$build-publi
sher/ws/src/main/java/hudson/plugins/build_publisher/BuildPublisher.java
:139: cannot find symbol
> symbol  : method getParameterValues(java.lang.String)
> location: interface org.kohsuke.stapler.StaplerRequest
>             String[] urls = req.getParameterValues("url");
>                                ^
>
http://hudson.ramfelt.se/job/Hudson/org.jvnet.hudson.plugins$build-publi
sher/ws/src/main/java/hudson/plugins/build_publisher/BuildPublisher.java
:140: cannot find symbol
> symbol  : method getParameterValues(java.lang.String)
> location: interface org.kohsuke.stapler.StaplerRequest
>             String[] logins = req.getParameterValues("login");
>                                  ^
>
http://hudson.ramfelt.se/job/Hudson/org.jvnet.hudson.plugins$build-publi
sher/ws/src/main/java/hudson/plugins/build_publisher/BuildPublisher.java
:141: cannot find symbol
> symbol  : method getParameterValues(java.lang.String)
> location: interface org.kohsuke.stapler.StaplerRequest
>             String[] passwords = req.getParameterValues("password");
>                                     ^
>
http://hudson.ramfelt.se/job/Hudson/org.jvnet.hudson.plugins$build-publi
sher/ws/src/main/java/hudson/plugins/build_publisher/StatusAction.java
:67: cannot access javax.servlet.http.HttpServletResponse
> class file for javax.servlet.http.HttpServletResponse not found
>         rsp.forwardToPreviousPage(req);
>            ^
> Note: Some input files use or override a deprecated API.
> Note: Recompile with -Xlint:deprecation for details.
> Note: Some input files use unchecked or unsafe operations.
> Note: Recompile with -Xlint:unchecked for details.
> 9 errors
> [HUDSON] Archiving
http://hudson.ramfelt.se/job/Hudson/org.jvnet.hudson.plugins$build-publi
sher/ws/pom.xml
> [INFO]
------------------------------------------------------------------------
> [ERROR] BUILD ERROR
> [INFO]
------------------------------------------------------------------------
> [INFO] Fatal error compiling
>
> Embedded error: APT failed: 1
> [INFO]
------------------------------------------------------------------------
> [INFO] For more information, run Maven with the -e switch
> [INFO]
------------------------------------------------------------------------
> [INFO] Total time: 12 minutes 38 seconds
> [INFO] Finished at: Sat Dec 01 00:15:50 CET 2007
>
> ---------------------------------------------------------------------
> To unsubscribe, e-mail: [hidden email]
> For additional commands, e-mail: [hidden email]
>
>


--
Kohsuke Kawaguchi

---------------------------------------------------------------------
To unsubscribe, e-mail: [hidden email]
For additional commands, e-mail: [hidden email]

---------------------------------------------------------------------
To unsubscribe, e-mail: [hidden email]
For additional commands, e-mail: [hidden email]