Jenkins build from source broken

classic Classic list List threaded Threaded
3 messages Options
Reply | Threaded
Open this post in threaded view
|

Jenkins build from source broken

Gerry Storm
Hi,

mvn install stopped working within the last 24 hours.
I did a clean download, tried and saw the following error:


mvn install -DskipTests
...
[INFO] Scanning for projects...
[INFO] ------------------------------------------------------------------------
[INFO] Reactor Build Order:
[INFO]
[INFO] Jenkins main module                                                [pom]
[INFO] Jenkins cli                                                        [jar]
[INFO] Jenkins core                                                       [jar]
[INFO] Jenkins war                                                        [war]
[INFO] Jenkins core tests POM                                             [pom]
[INFO] Tests for Jenkins core                                             [jar]
[INFO] JDK8-only tests for Jenkins core                                   [jar]
[INFO]
[INFO] -----------------< org.jenkins-ci.main:jenkins-parent >-----------------
[INFO] Building Jenkins main module 2.161-SNAPSHOT                        [1/7]
[INFO] --------------------------------[ pom ]---------------------------------
[INFO] ------------------------------------------------------------------------
[INFO] Reactor Summary:
[INFO]
[INFO] Jenkins main module 2.161-SNAPSHOT ................. FAILURE [  0.110 s]
[INFO] Jenkins cli ........................................ SKIPPED
[INFO] Jenkins core ....................................... SKIPPED
[INFO] Jenkins war ........................................ SKIPPED
[INFO] Jenkins core tests POM ............................. SKIPPED
[INFO] Tests for Jenkins core ............................. SKIPPED
[INFO] JDK8-only tests for Jenkins core 2.161-SNAPSHOT .... SKIPPED
[INFO] ------------------------------------------------------------------------
[INFO] BUILD FAILURE
[INFO] ------------------------------------------------------------------------
[INFO] Total time: 4.329 s
[INFO] Finished at: 2019-01-20T09:43:57-08:00
[INFO] ------------------------------------------------------------------------
[ERROR] Failed to execute goal on project jenkins-parent: Could not resolve dependencies for project org.jenkins-ci.main:jenkins-parent:pom:2.161-SNAPSHOT: Failed to collect dependencies at javax.servlet:servlet-api:jar:[0,0]: No versions available for javax.servlet:servlet-api:jar:[0,0] within specified range -> [Help 1]
[ERROR]
[ERROR] To see the full stack trace of the errors, re-run Maven with the -e switch.
[ERROR] Re-run Maven using the -X switch to enable full debug logging.
[ERROR]
[ERROR] For more information about the errors and possible solutions, please read the following articles:
[ERROR] [Help 1] http://cwiki.apache.org/confluence/display/MAVEN/DependencyResolutionException


--
You received this message because you are subscribed to the Google Groups "Jenkins Developers" group.
To unsubscribe from this group and stop receiving emails from it, send an email to [hidden email].
To view this discussion on the web visit https://groups.google.com/d/msgid/jenkinsci-dev/e5d28d40-964c-4b5b-92af-b1cab385cb27%40googlegroups.com.
For more options, visit https://groups.google.com/d/optout.
Reply | Threaded
Open this post in threaded view
|

Re: Jenkins build from source broken

Baptiste MATHUS
Yeah, that is weird, also happened on CI since very recently on the latest master. Likely a temporary network glitch, you likely want to just retry.

I created https://github.com/jenkinsci/jenkins/pull/3856 to retry, but FYI I tested also locally and it succeeded.

Cheers

Le dim. 20 janv. 2019 à 18:51, Gerry Storm <[hidden email]> a écrit :
Hi,

mvn install stopped working within the last 24 hours.
I did a clean download, tried and saw the following error:


mvn install -DskipTests
...
[INFO] Scanning for projects...
[INFO] ------------------------------------------------------------------------
[INFO] Reactor Build Order:
[INFO]
[INFO] Jenkins main module                                                [pom]
[INFO] Jenkins cli                                                        [jar]
[INFO] Jenkins core                                                       [jar]
[INFO] Jenkins war                                                        [war]
[INFO] Jenkins core tests POM                                             [pom]
[INFO] Tests for Jenkins core                                             [jar]
[INFO] JDK8-only tests for Jenkins core                                   [jar]
[INFO]
[INFO] -----------------< org.jenkins-ci.main:jenkins-parent >-----------------
[INFO] Building Jenkins main module 2.161-SNAPSHOT                        [1/7]
[INFO] --------------------------------[ pom ]---------------------------------
[INFO] ------------------------------------------------------------------------
[INFO] Reactor Summary:
[INFO]
[INFO] Jenkins main module 2.161-SNAPSHOT ................. FAILURE [  0.110 s]
[INFO] Jenkins cli ........................................ SKIPPED
[INFO] Jenkins core ....................................... SKIPPED
[INFO] Jenkins war ........................................ SKIPPED
[INFO] Jenkins core tests POM ............................. SKIPPED
[INFO] Tests for Jenkins core ............................. SKIPPED
[INFO] JDK8-only tests for Jenkins core 2.161-SNAPSHOT .... SKIPPED
[INFO] ------------------------------------------------------------------------
[INFO] BUILD FAILURE
[INFO] ------------------------------------------------------------------------
[INFO] Total time: 4.329 s
[INFO] Finished at: 2019-01-20T09:43:57-08:00
[INFO] ------------------------------------------------------------------------
[ERROR] Failed to execute goal on project jenkins-parent: Could not resolve dependencies for project org.jenkins-ci.main:jenkins-parent:pom:2.161-SNAPSHOT: Failed to collect dependencies at javax.servlet:servlet-api:jar:[0,0]: No versions available for javax.servlet:servlet-api:jar:[0,0] within specified range -> [Help 1]
[ERROR]
[ERROR] To see the full stack trace of the errors, re-run Maven with the -e switch.
[ERROR] Re-run Maven using the -X switch to enable full debug logging.
[ERROR]
[ERROR] For more information about the errors and possible solutions, please read the following articles:
[ERROR] [Help 1] http://cwiki.apache.org/confluence/display/MAVEN/DependencyResolutionException


--
You received this message because you are subscribed to the Google Groups "Jenkins Developers" group.
To unsubscribe from this group and stop receiving emails from it, send an email to [hidden email].
To view this discussion on the web visit https://groups.google.com/d/msgid/jenkinsci-dev/e5d28d40-964c-4b5b-92af-b1cab385cb27%40googlegroups.com.
For more options, visit https://groups.google.com/d/optout.

--
You received this message because you are subscribed to the Google Groups "Jenkins Developers" group.
To unsubscribe from this group and stop receiving emails from it, send an email to [hidden email].
To view this discussion on the web visit https://groups.google.com/d/msgid/jenkinsci-dev/CANWgJS4CcPM-frHz0zP_b_YrTKwCV8abfT4-PATdU1Ed3RP9bA%40mail.gmail.com.
For more options, visit https://groups.google.com/d/optout.
Reply | Threaded
Open this post in threaded view
|

Re: Jenkins build from source broken

Gerry Storm
You are correct, I retried recently and it passed. I guess the remote repo was down or unreachable.

On Sunday, January 20, 2019 at 11:59:42 AM UTC-8, Baptiste Mathus wrote:
Yeah, that is weird, also happened on CI since very recently on the latest master. Likely a temporary network glitch, you likely want to just retry.

I created <a href="https://github.com/jenkinsci/jenkins/pull/3856" target="_blank" rel="nofollow" onmousedown="this.href=&#39;https://www.google.com/url?q\x3dhttps%3A%2F%2Fgithub.com%2Fjenkinsci%2Fjenkins%2Fpull%2F3856\x26sa\x3dD\x26sntz\x3d1\x26usg\x3dAFQjCNF9sUijjX-2NzrUqzY8i6FJcdp8yQ&#39;;return true;" onclick="this.href=&#39;https://www.google.com/url?q\x3dhttps%3A%2F%2Fgithub.com%2Fjenkinsci%2Fjenkins%2Fpull%2F3856\x26sa\x3dD\x26sntz\x3d1\x26usg\x3dAFQjCNF9sUijjX-2NzrUqzY8i6FJcdp8yQ&#39;;return true;">https://github.com/jenkinsci/jenkins/pull/3856 to retry, but FYI I tested also locally and it succeeded.

Cheers

Le dim. 20 janv. 2019 à 18:51, Gerry Storm <<a href="javascript:" target="_blank" gdf-obfuscated-mailto="hTxQrvkUFQAJ" rel="nofollow" onmousedown="this.href=&#39;javascript:&#39;;return true;" onclick="this.href=&#39;javascript:&#39;;return true;">gstor...@...> a écrit :
Hi,

mvn install stopped working within the last 24 hours.
I did a clean download, tried and saw the following error:


mvn install -DskipTests
...
[INFO] Scanning for projects...
[INFO] ------------------------------------------------------------------------
[INFO] Reactor Build Order:
[INFO]
[INFO] Jenkins main module                                                [pom]
[INFO] Jenkins cli                                                        [jar]
[INFO] Jenkins core                                                       [jar]
[INFO] Jenkins war                                                        [war]
[INFO] Jenkins core tests POM                                             [pom]
[INFO] Tests for Jenkins core                                             [jar]
[INFO] JDK8-only tests for Jenkins core                                   [jar]
[INFO]
[INFO] -----------------< org.jenkins-ci.main:jenkins-parent >-----------------
[INFO] Building Jenkins main module 2.161-SNAPSHOT                        [1/7]
[INFO] --------------------------------[ pom ]---------------------------------
[INFO] ------------------------------------------------------------------------
[INFO] Reactor Summary:
[INFO]
[INFO] Jenkins main module 2.161-SNAPSHOT ................. FAILURE [  0.110 s]
[INFO] Jenkins cli ........................................ SKIPPED
[INFO] Jenkins core ....................................... SKIPPED
[INFO] Jenkins war ........................................ SKIPPED
[INFO] Jenkins core tests POM ............................. SKIPPED
[INFO] Tests for Jenkins core ............................. SKIPPED
[INFO] JDK8-only tests for Jenkins core 2.161-SNAPSHOT .... SKIPPED
[INFO] ------------------------------------------------------------------------
[INFO] BUILD FAILURE
[INFO] ------------------------------------------------------------------------
[INFO] Total time: 4.329 s
[INFO] Finished at: 2019-01-20T09:43:57-08:00
[INFO] ------------------------------------------------------------------------
[ERROR] Failed to execute goal on project jenkins-parent: Could not resolve dependencies for project org.jenkins-ci.main:jenkins-parent:pom:2.161-SNAPSHOT: Failed to collect dependencies at javax.servlet:servlet-api:jar:[0,0]: No versions available for javax.servlet:servlet-api:jar:[0,0] within specified range -> [Help 1]
[ERROR]
[ERROR] To see the full stack trace of the errors, re-run Maven with the -e switch.
[ERROR] Re-run Maven using the -X switch to enable full debug logging.
[ERROR]
[ERROR] For more information about the errors and possible solutions, please read the following articles:
[ERROR] [Help 1] <a href="http://cwiki.apache.org/confluence/display/MAVEN/DependencyResolutionException" rel="nofollow" target="_blank" onmousedown="this.href=&#39;http://www.google.com/url?q\x3dhttp%3A%2F%2Fcwiki.apache.org%2Fconfluence%2Fdisplay%2FMAVEN%2FDependencyResolutionException\x26sa\x3dD\x26sntz\x3d1\x26usg\x3dAFQjCNFWEeQP6-kQu7fumdQB3K_DSIiA2w&#39;;return true;" onclick="this.href=&#39;http://www.google.com/url?q\x3dhttp%3A%2F%2Fcwiki.apache.org%2Fconfluence%2Fdisplay%2FMAVEN%2FDependencyResolutionException\x26sa\x3dD\x26sntz\x3d1\x26usg\x3dAFQjCNFWEeQP6-kQu7fumdQB3K_DSIiA2w&#39;;return true;">http://cwiki.apache.org/confluence/display/MAVEN/DependencyResolutionException


--
You received this message because you are subscribed to the Google Groups "Jenkins Developers" group.
To unsubscribe from this group and stop receiving emails from it, send an email to <a href="javascript:" rel="nofollow" target="_blank" gdf-obfuscated-mailto="hTxQrvkUFQAJ" onmousedown="this.href=&#39;javascript:&#39;;return true;" onclick="this.href=&#39;javascript:&#39;;return true;">jenkinsci-de...@googlegroups.com.
To view this discussion on the web visit <a href="https://groups.google.com/d/msgid/jenkinsci-dev/e5d28d40-964c-4b5b-92af-b1cab385cb27%40googlegroups.com?utm_medium=email&amp;utm_source=footer" rel="nofollow" target="_blank" onmousedown="this.href=&#39;https://groups.google.com/d/msgid/jenkinsci-dev/e5d28d40-964c-4b5b-92af-b1cab385cb27%40googlegroups.com?utm_medium\x3demail\x26utm_source\x3dfooter&#39;;return true;" onclick="this.href=&#39;https://groups.google.com/d/msgid/jenkinsci-dev/e5d28d40-964c-4b5b-92af-b1cab385cb27%40googlegroups.com?utm_medium\x3demail\x26utm_source\x3dfooter&#39;;return true;">https://groups.google.com/d/msgid/jenkinsci-dev/e5d28d40-964c-4b5b-92af-b1cab385cb27%40googlegroups.com.
For more options, visit <a href="https://groups.google.com/d/optout" rel="nofollow" target="_blank" onmousedown="this.href=&#39;https://groups.google.com/d/optout&#39;;return true;" onclick="this.href=&#39;https://groups.google.com/d/optout&#39;;return true;">https://groups.google.com/d/optout.

--
You received this message because you are subscribed to the Google Groups "Jenkins Developers" group.
To unsubscribe from this group and stop receiving emails from it, send an email to [hidden email].
To view this discussion on the web visit https://groups.google.com/d/msgid/jenkinsci-dev/23b0da1e-dfaf-4c6d-9c30-83845a5f077e%40googlegroups.com.
For more options, visit https://groups.google.com/d/optout.