Perforce plugin has broken the build

classic Classic list List threaded Threaded
5 messages Options
Reply | Threaded
Open this post in threaded view
|

Perforce plugin has broken the build

Stephen Connolly-2
Reply | Threaded
Open this post in threaded view
|

Re: Perforce plugin has broken the build

Stephen Connolly-2

[INFO] ----------------------------------------------------------------------------
[INFO] Building Hudson Perforce Plugin
[INFO]    task-segment: [clean, install]
[INFO] ----------------------------------------------------------------------------
[INFO] [clean:clean]
[INFO] Deleting directory /home/hudson/./data/jobs/Hudson/workspace/plugins/perforce/target
[INFO] Deleting directory /home/hudson/./data/jobs/Hudson/workspace/plugins/perforce/target/classes
[INFO] Deleting directory /home/hudson/./data/jobs/Hudson/workspace/plugins/perforce/target/test-classes
[INFO] Deleting directory /home/hudson/./data/jobs/Hudson/workspace/plugins/perforce/target/site
[INFO] [enforcer:display-info {execution: default}]
[INFO] Maven Version: 2.0.6
[INFO] JDK Version: 1.6.0_02 normalized as: 1.6.0-2
[INFO] OS Info: Arch: i386 Family: unix Name: linux Version: 2.6.18-5-686
[INFO] [resources:resources]
[INFO] Using default encoding to copy filtered resources.
[INFO] [hpi:apt-compile]
[INFO] Compiling 10 source files to /home/hudson/./data/jobs/Hudson/workspace/plugins/perforce/target/classes
Note: Generating hudson/plugins/perforce/browsers/FishEyePerforce.stapler
Note: Generating hudson/plugins/perforce/browsers/P4Web.stapler
Note: Some input files use or override a deprecated API.
Note: Recompile with -Xlint:deprecation for details.
[INFO] [resources:testResources]
[INFO] Using default encoding to copy filtered resources.
[INFO] [compiler:testCompile]
[INFO] Compiling 2 source files to /home/hudson/./data/jobs/Hudson/workspace/plugins/perforce/target/test-classes
[HUDSON] Archiving /home/hudson/./data/jobs/Hudson/workspace/plugins/perforce/pom.xml
[INFO] ------------------------------------------------------------------------
[ERROR] BUILD FAILURE
[INFO] ------------------------------------------------------------------------
[INFO] Compilation failure

/home/hudson/./data/jobs/Hudson/workspace/plugins/perforce/src/test/java/hudson/plugins/perforce/PerforceSCMHelperTest.java:[14,9] cannot find symbol
symbol  : variable PerforceSCMHelper
location: class hudson.plugins.perforce.PerforceSCMHelperTest

/home/hudson/./data/jobs/Hudson/workspace/plugins/perforce/src/test/java/hudson/plugins/perforce/PerforceSCMHelperTest.java:[19,9] cannot find symbol
symbol  : variable PerforceSCMHelper
location: class hudson.plugins.perforce.PerforceSCMHelperTest

/home/hudson/./data/jobs/Hudson/workspace/plugins/perforce/src/test/java/hudson/plugins/perforce/PerforceSCMHelperTest.java:[23,9] cannot find symbol
symbol  : variable PerforceSCMHelper
location: class hudson.plugins.perforce.PerforceSCMHelperTest

/home/hudson/./data/jobs/Hudson/workspace/plugins/perforce/src/test/java/hudson/plugins/perforce/PerforceSCMHelperTest.java:[27,9] cannot find symbol
symbol  : variable PerforceSCMHelper
location: class hudson.plugins.perforce.PerforceSCMHelperTest

/home/hudson/./data/jobs/Hudson/workspace/plugins/perforce/src/test/java/com/tek42/perforce/parse/ChangesTest.java:[41,3] getChangeNumbersTo(java.lang.String,int) in com.tek42.perforce.parse.Changes cannot be applied to (java.lang.String,java.lang.String,int)


[INFO] ------------------------------------------------------------------------
[INFO] For more information, run Maven with the -e switch
[INFO] ------------------------------------------------------------------------
[INFO] Total time: 29 minutes 32 seconds
[INFO] Finished at: Thu Nov 08 06:33:42 CET 2007

Reply | Threaded
Open this post in threaded view
|

Re: Perforce plugin has broken the build

bwestrich
Oops, sorry about that. I'm still making a few mistakes as I refamiliarize myself with cvs branching.

I just committed a change that will solve the below compile error. Hopefully that's all that's needed immediately...

On Nov 8, 2007 6:22 AM, Stephen Connolly <[hidden email]> wrote:
[INFO]
----------------------------------------------------------------------------
[INFO] Building Hudson Perforce Plugin
[INFO]    task-segment: [clean, install]
[INFO]
----------------------------------------------------------------------------
[INFO] [clean:clean]
[INFO] Deleting directory
/home/hudson/./data/jobs/Hudson/workspace/plugins/perforce/target
[INFO] Deleting directory
/home/hudson/./data/jobs/Hudson/workspace/plugins/perforce/target/classes
[INFO] Deleting directory
/home/hudson/./data/jobs/Hudson/workspace/plugins/perforce/target/test-classes
[INFO] Deleting directory
/home/hudson/./data/jobs/Hudson/workspace/plugins/perforce/target/site
[INFO] [enforcer:display-info {execution: default}]
[INFO] Maven Version: 2.0.6
[INFO] JDK Version: 1.6.0_02 normalized as: 1.6.0-2
[INFO] OS Info: Arch: i386 Family: unix Name: linux Version: 2.6.18-5-686
[INFO] [resources:resources]
[INFO] Using default encoding to copy filtered resources.
[INFO] [hpi:apt-compile]
[INFO] Compiling 10 source files to
/home/hudson/./data/jobs/Hudson/workspace/plugins/perforce/target/classes
Note: Generating hudson/plugins/perforce/browsers/FishEyePerforce.stapler
Note: Generating hudson/plugins/perforce/browsers/P4Web.stapler
Note: Some input files use or override a deprecated API.
Note: Recompile with -Xlint:deprecation for details.
[INFO] [resources:testResources]
[INFO] Using default encoding to copy filtered resources.
[INFO] [compiler:testCompile]
[INFO] Compiling 2 source files to
/home/hudson/./data/jobs/Hudson/workspace/plugins/perforce/target/test-classes
[HUDSON] Archiving
/home/hudson/./data/jobs/Hudson/workspace/plugins/perforce/pom.xml
[INFO]
------------------------------------------------------------------------
[ERROR] BUILD FAILURE
[INFO]
------------------------------------------------------------------------
[INFO] Compilation failure

/home/hudson/./data/jobs/Hudson/workspace/plugins/perforce/src/test/java/hudson/plugins/perforce/PerforceSCMHelperTest.java:[14,9]
cannot find symbol
symbol  : variable PerforceSCMHelper
location: class hudson.plugins.perforce.PerforceSCMHelperTest

/home/hudson/./data/jobs/Hudson/workspace/plugins/perforce/src/test/java/hudson/plugins/perforce/PerforceSCMHelperTest.java:[19,9]
cannot find symbol
symbol  : variable PerforceSCMHelper
location: class hudson.plugins.perforce.PerforceSCMHelperTest

/home/hudson/./data/jobs/Hudson/workspace/plugins/perforce/src/test/java/hudson/plugins/perforce/PerforceSCMHelperTest.java:[23,9]
cannot find symbol
symbol  : variable PerforceSCMHelper
location: class hudson.plugins.perforce.PerforceSCMHelperTest

/home/hudson/./data/jobs/Hudson/workspace/plugins/perforce/src/test/java/hudson/plugins/perforce/PerforceSCMHelperTest.java:[27,9]
cannot find symbol
symbol  : variable PerforceSCMHelper
location: class hudson.plugins.perforce.PerforceSCMHelperTest

/home/hudson/./data/jobs/Hudson/workspace/plugins/perforce/src/test/java/com/tek42/perforce/parse/ChangesTest.java:[41,3]
getChangeNumbersTo(java.lang.String,int) in com.tek42.perforce.parse.Changes
cannot be applied to (java.lang.String,java.lang.String,int)


[INFO]
------------------------------------------------------------------------
[INFO] For more information, run Maven with the -e switch
[INFO]
------------------------------------------------------------------------
[INFO] Total time: 29 minutes 32 seconds
[INFO] Finished at: Thu Nov 08 06:33:42 CET 2007


--
View this message in context: http://www.nabble.com/Perforce-plugin-has-broken-the-build-tf4770576.html#a13645907
Sent from the Hudson dev mailing list archive at Nabble.com.

---------------------------------------------------------------------
To unsubscribe, e-mail: [hidden email]
For additional commands, e-mail: [hidden email]


Reply | Threaded
Open this post in threaded view
|

Re: Perforce plugin has broken the build

Stephen Connolly-2
I'll let you know, Eric's hudson is on a once every 3 hours polling.

My own hudson (which is private) is on a hair-trigger, so I'll let you know how it gets on
Brian Westrich-2 wrote
Oops, sorry about that. I'm still making a few mistakes as I refamiliarize
myself with cvs branching.

I just committed a change that will solve the below compile error. Hopefully
that's all that's needed immediately...

On Nov 8, 2007 6:22 AM, Stephen Connolly <stephenconnolly@one-dash.com>
wrote:

>
>
>
> Stephen Connolly wrote:
> >
> > http://hudson.ramfelt.se/job/Hudson/108/
> >
> > The commit that probably did this is
> >
> >
> http://fisheye5.cenqua.com/changelog/hudson/hudson?cs=MAIN:bwestrich:20071108042454
> >
> [INFO]
>
> ----------------------------------------------------------------------------
> [INFO] Building Hudson Perforce Plugin
> [INFO]    task-segment: [clean, install]
> [INFO]
>
> ----------------------------------------------------------------------------
> [INFO] [clean:clean]
> [INFO] Deleting directory
> /home/hudson/./data/jobs/Hudson/workspace/plugins/perforce/target
> [INFO] Deleting directory
> /home/hudson/./data/jobs/Hudson/workspace/plugins/perforce/target/classes
> [INFO] Deleting directory
>
> /home/hudson/./data/jobs/Hudson/workspace/plugins/perforce/target/test-classes
> [INFO] Deleting directory
> /home/hudson/./data/jobs/Hudson/workspace/plugins/perforce/target/site
> [INFO] [enforcer:display-info {execution: default}]
> [INFO] Maven Version: 2.0.6
> [INFO] JDK Version: 1.6.0_02 normalized as: 1.6.0-2
> [INFO] OS Info: Arch: i386 Family: unix Name: linux Version: 2.6.18-5-686
> [INFO] [resources:resources]
> [INFO] Using default encoding to copy filtered resources.
> [INFO] [hpi:apt-compile]
> [INFO] Compiling 10 source files to
> /home/hudson/./data/jobs/Hudson/workspace/plugins/perforce/target/classes
> Note: Generating hudson/plugins/perforce/browsers/FishEyePerforce.stapler
> Note: Generating hudson/plugins/perforce/browsers/P4Web.stapler
> Note: Some input files use or override a deprecated API.
> Note: Recompile with -Xlint:deprecation for details.
> [INFO] [resources:testResources]
> [INFO] Using default encoding to copy filtered resources.
> [INFO] [compiler:testCompile]
> [INFO] Compiling 2 source files to
>
> /home/hudson/./data/jobs/Hudson/workspace/plugins/perforce/target/test-classes
> [HUDSON] Archiving
> /home/hudson/./data/jobs/Hudson/workspace/plugins/perforce/pom.xml
> [INFO]
> ------------------------------------------------------------------------
> [ERROR] BUILD FAILURE
> [INFO]
> ------------------------------------------------------------------------
> [INFO] Compilation failure
>
>
> /home/hudson/./data/jobs/Hudson/workspace/plugins/perforce/src/test/java/hudson/plugins/perforce/PerforceSCMHelperTest.java:[14,9]
> cannot find symbol
> symbol  : variable PerforceSCMHelper
> location: class hudson.plugins.perforce.PerforceSCMHelperTest
>
>
> /home/hudson/./data/jobs/Hudson/workspace/plugins/perforce/src/test/java/hudson/plugins/perforce/PerforceSCMHelperTest.java:[19,9]
> cannot find symbol
> symbol  : variable PerforceSCMHelper
> location: class hudson.plugins.perforce.PerforceSCMHelperTest
>
>
> /home/hudson/./data/jobs/Hudson/workspace/plugins/perforce/src/test/java/hudson/plugins/perforce/PerforceSCMHelperTest.java:[23,9]
> cannot find symbol
> symbol  : variable PerforceSCMHelper
> location: class hudson.plugins.perforce.PerforceSCMHelperTest
>
>
> /home/hudson/./data/jobs/Hudson/workspace/plugins/perforce/src/test/java/hudson/plugins/perforce/PerforceSCMHelperTest.java:[27,9]
> cannot find symbol
> symbol  : variable PerforceSCMHelper
> location: class hudson.plugins.perforce.PerforceSCMHelperTest
>
>
> /home/hudson/./data/jobs/Hudson/workspace/plugins/perforce/src/test/java/com/tek42/perforce/parse/ChangesTest.java:[41,3]
> getChangeNumbersTo(java.lang.String,int) in
> com.tek42.perforce.parse.Changes
> cannot be applied to (java.lang.String,java.lang.String,int)
>
>
> [INFO]
> ------------------------------------------------------------------------
> [INFO] For more information, run Maven with the -e switch
> [INFO]
> ------------------------------------------------------------------------
> [INFO] Total time: 29 minutes 32 seconds
> [INFO] Finished at: Thu Nov 08 06:33:42 CET 2007
>
>
> --
> View this message in context:
> http://www.nabble.com/Perforce-plugin-has-broken-the-build-tf4770576.html#a13645907
> Sent from the Hudson dev mailing list archive at Nabble.com.
>
> ---------------------------------------------------------------------
> To unsubscribe, e-mail: dev-unsubscribe@hudson.dev.java.net
> For additional commands, e-mail: dev-help@hudson.dev.java.net
>
>
Reply | Threaded
Open this post in threaded view
|

Re: Perforce plugin has broken the build

Stephen Connolly-2
Building again
Stephen Connolly wrote
I'll let you know, Eric's hudson is on a once every 3 hours polling.

My own hudson (which is private) is on a hair-trigger, so I'll let you know how it gets on
Brian Westrich-2 wrote
Oops, sorry about that. I'm still making a few mistakes as I refamiliarize
myself with cvs branching.

I just committed a change that will solve the below compile error. Hopefully
that's all that's needed immediately...

On Nov 8, 2007 6:22 AM, Stephen Connolly <stephenconnolly@one-dash.com>
wrote:

>
>
>
> Stephen Connolly wrote:
> >
> > http://hudson.ramfelt.se/job/Hudson/108/
> >
> > The commit that probably did this is
> >
> >
> http://fisheye5.cenqua.com/changelog/hudson/hudson?cs=MAIN:bwestrich:20071108042454
> >
> [INFO]
>
> ----------------------------------------------------------------------------
> [INFO] Building Hudson Perforce Plugin
> [INFO]    task-segment: [clean, install]
> [INFO]
>
> ----------------------------------------------------------------------------
> [INFO] [clean:clean]
> [INFO] Deleting directory
> /home/hudson/./data/jobs/Hudson/workspace/plugins/perforce/target
> [INFO] Deleting directory
> /home/hudson/./data/jobs/Hudson/workspace/plugins/perforce/target/classes
> [INFO] Deleting directory
>
> /home/hudson/./data/jobs/Hudson/workspace/plugins/perforce/target/test-classes
> [INFO] Deleting directory
> /home/hudson/./data/jobs/Hudson/workspace/plugins/perforce/target/site
> [INFO] [enforcer:display-info {execution: default}]
> [INFO] Maven Version: 2.0.6
> [INFO] JDK Version: 1.6.0_02 normalized as: 1.6.0-2
> [INFO] OS Info: Arch: i386 Family: unix Name: linux Version: 2.6.18-5-686
> [INFO] [resources:resources]
> [INFO] Using default encoding to copy filtered resources.
> [INFO] [hpi:apt-compile]
> [INFO] Compiling 10 source files to
> /home/hudson/./data/jobs/Hudson/workspace/plugins/perforce/target/classes
> Note: Generating hudson/plugins/perforce/browsers/FishEyePerforce.stapler
> Note: Generating hudson/plugins/perforce/browsers/P4Web.stapler
> Note: Some input files use or override a deprecated API.
> Note: Recompile with -Xlint:deprecation for details.
> [INFO] [resources:testResources]
> [INFO] Using default encoding to copy filtered resources.
> [INFO] [compiler:testCompile]
> [INFO] Compiling 2 source files to
>
> /home/hudson/./data/jobs/Hudson/workspace/plugins/perforce/target/test-classes
> [HUDSON] Archiving
> /home/hudson/./data/jobs/Hudson/workspace/plugins/perforce/pom.xml
> [INFO]
> ------------------------------------------------------------------------
> [ERROR] BUILD FAILURE
> [INFO]
> ------------------------------------------------------------------------
> [INFO] Compilation failure
>
>
> /home/hudson/./data/jobs/Hudson/workspace/plugins/perforce/src/test/java/hudson/plugins/perforce/PerforceSCMHelperTest.java:[14,9]
> cannot find symbol
> symbol  : variable PerforceSCMHelper
> location: class hudson.plugins.perforce.PerforceSCMHelperTest
>
>
> /home/hudson/./data/jobs/Hudson/workspace/plugins/perforce/src/test/java/hudson/plugins/perforce/PerforceSCMHelperTest.java:[19,9]
> cannot find symbol
> symbol  : variable PerforceSCMHelper
> location: class hudson.plugins.perforce.PerforceSCMHelperTest
>
>
> /home/hudson/./data/jobs/Hudson/workspace/plugins/perforce/src/test/java/hudson/plugins/perforce/PerforceSCMHelperTest.java:[23,9]
> cannot find symbol
> symbol  : variable PerforceSCMHelper
> location: class hudson.plugins.perforce.PerforceSCMHelperTest
>
>
> /home/hudson/./data/jobs/Hudson/workspace/plugins/perforce/src/test/java/hudson/plugins/perforce/PerforceSCMHelperTest.java:[27,9]
> cannot find symbol
> symbol  : variable PerforceSCMHelper
> location: class hudson.plugins.perforce.PerforceSCMHelperTest
>
>
> /home/hudson/./data/jobs/Hudson/workspace/plugins/perforce/src/test/java/com/tek42/perforce/parse/ChangesTest.java:[41,3]
> getChangeNumbersTo(java.lang.String,int) in
> com.tek42.perforce.parse.Changes
> cannot be applied to (java.lang.String,java.lang.String,int)
>
>
> [INFO]
> ------------------------------------------------------------------------
> [INFO] For more information, run Maven with the -e switch
> [INFO]
> ------------------------------------------------------------------------
> [INFO] Total time: 29 minutes 32 seconds
> [INFO] Finished at: Thu Nov 08 06:33:42 CET 2007
>
>
> --
> View this message in context:
> http://www.nabble.com/Perforce-plugin-has-broken-the-build-tf4770576.html#a13645907
> Sent from the Hudson dev mailing list archive at Nabble.com.
>
> ---------------------------------------------------------------------
> To unsubscribe, e-mail: dev-unsubscribe@hudson.dev.java.net
> For additional commands, e-mail: dev-help@hudson.dev.java.net
>
>